{"text_format":"1","workbook":"xlsx","n_sheets":18,"sheets":["Introduction","Listed Activities","Other Activities","Complexities","Air","Water","Land","Sewer","Waste","Emissions Summary","Location","Op Perf","EP Summary","Calculation","Compliance Rating","XML Data","Amendment record","Lookup"],"not_rendered":{"charts":4,"images":5,"macros":1,"external_links":0,"defined_names":117,"comments":5,"pivot_tables":0},"unopened":[],"bounds":{"document_bytes":16777216,"sheet_cells":100000,"rows_first":2000,"rows_last":500,"rows_between":2000,"halvings":0,"cell_chars":16384,"cell_head_chars":4096},"cells_cut":0,"cells_raw":0,"read":"whole","date_system":"1900"}

{"sheet":"Introduction","index":0,"n_rows":41,"n_cols":9,"rows_kept":41,"cut":false,"hidden":false,"merged":[[2,3,5,7],[11,2,16,12],[7,8,7,9],[7,2,7,3],[9,7,9,12],[6,11,7,13],[7,4,7,5],[6,3,6,8],[31,8,35,12],[22,2,25,6],[26,2,26,5],[36,8,39,12],[28,2,28,6],[29,2,29,5],[27,2,27,6],[18,8,19,12],[22,8,22,12],[30,2,30,6],[28,8,29,12],[18,2,18,5],[19,2,19,7]]}
[]
[]
[null,null,null,"Operational Risk Appraisal (Opra) for Installations under EPR"]
[]
[]
[]
[]
[null,null,"Organisation Name",null,"Horizon Nuclear Power Wylfa Ltd",null,null,"Case Number"]
[]
[null,null,"Version","NRW V1",null,null,null,"Opra Scheme NRW V1"]
[]
[null,null,"Full instructions for the use of this spreadsheet are contained in the accompanying documentation.\nIt is recommended that the user fills in the spreadsheet following the order of worksheets listed below (click on the appropriate tab at the bottom of the screen).\nNot all worksheets require input, for those that do, the fields that may require input have no background colour.\nThe sequence of worksheets is divided into two sections Sheets 1 to 11 are concerned with the input of data. Sheet 12 is the summary for the Opra Scores and Sheet 13 displays the charges. \nIf you cannot see the whole of this box or it is very small, please click 'View' and adjust 'Zoom' level."]
[]
[]
[]
{"$rows_left_out":27}
{"sheet":"Listed Activities","index":1,"n_rows":319,"n_cols":11,"rows_kept":319,"cut":false,"hidden":false,"merged":[[47,8,47,9],[1,1,1,10],[15,9,19,10],[6,9,6,10],[24,9,26,10],[36,2,36,4],[37,2,37,4],[42,8,42,9],[43,8,43,9],[44,8,44,9],[45,8,45,9],[46,8,46,9],[59,8,59,9],[48,8,48,9],[49,8,49,9],[50,8,50,9],[51,8,51,9],[52,8,52,9],[53,8,53,9],[54,8,54,9],[55,8,55,9],[56,8,56,9],[57,8,57,9],[58,8,58,9],[60,8,60,9],[61,8,61,9],[68,8,68,9],[68,4,68,5],[62,8,62,9],[67,4,67,5],[64,5,65,9],[67,8,67,9],[71,4,71,5],[72,4,72,5],[69,4,69,5],[70,4,70,5],[75,7,75,10],[69,8,69,9],[70,8,70,9],[71,8,71,9],[72,8,72,9]]}
[]
[null,"Listed Activities - Complexity Attribute"]
[]
[null,null,"Organisation:",{"$f":"Introduction!E8","v":"Horizon Nuclear Power Wylfa Ltd"}]
[null,null,"Case Number:",{"$f":"Introduction!I8","v":0}]
[]
[null,null,"Former Permit Ref   (If applicable)","Description of Activity","Schedule 1 Reference","Regulatory Complexity ",null,null,null,"Totals before any rules are applied"]
[null,null,1,"4 x 25tph Boilers","1.1 Part A (1) a) (i)","C",232,1,null,"A",{"$f":"SUMIF($F$8:$F$32,\"A\",$H$8:$H$32)","v":0}]
[null,null,2,"2 x 3tph Boilers","1.1 Part A (1) a) (i)","C",232,1,null,"B",{"$f":"SUMIF($F$8:$F$32,\"B\",$H$8:$H$32)","v":0}]
[null,null,3,"ASGs x2 ","1.1 Part A (1) a) (i)","C",232,1,null,"C",{"$f":"SUMIF($F$8:$F$32,\"C\",$H$8:$H$32)","v":7}]
[null,null,4,"BBGs x4 (Units 1 & 2)","1.1 Part A (1) a) (i)","C",232,1,null,"D",{"$f":"SUMIF($F$8:$F$32,\"D\",$H$8:$H$32)","v":0}]
[null,null,5,"EDGs x3 (Unit 1)","1.1 Part A (1) a) (i)","C",232,1,null,"E",{"$f":"SUMIF($F$8:$F$32,\"E\",$H$8:$H$32)","v":0}]
[null,null,6,"EDGs x3 (Unit 2)","1.1 Part A (1) a) (i)","C",232,1]
[null,null,7,"Firewater Pumps x2","1.1 Part A (1) a) (i)","C",232,1]
[null,null,8,null,null,null,null,1]
{"$rows_left_out":305}
{"sheet":"Other Activities","index":2,"n_rows":101,"n_cols":13,"rows_kept":101,"cut":false,"hidden":false,"merged":[[65,3,65,4],[1,1,1,7],[3,6,5,6],[42,2,42,5],[43,3,43,4],[3,2,3,3],[4,2,4,3],[3,4,3,5],[4,4,4,5],[36,2,36,4],[35,2,35,4],[2,4,2,5],[7,2,7,6]]}
[null,null,null,null,null,null,null,null,null,null,null,null,"This col is used to hold the enumerated list of sched activities"]
[null,"Aggregation and Schedule1 Part A(2) and Part B Activities"]
[]
[null,null,"Organisation Name:",null,{"$f":"Introduction!E8","v":"Horizon Nuclear Power Wylfa Ltd"},null,"If there is insufficient space please attach a paper record"]
[null,null,"Case Number:",null,{"$f":"Introduction!I8","v":0}]
[]
[]
[null,null,"Schedule 1 Part A(1) - Rule 4 Aggregation Details"]
[null,null,"Former Permit Ref (If applicable)","Aggregation\nGroup","Description","Schedule 1 Ref","Complexity"]
[null,null,1]
[null,null,2]
[null,null,3]
[null,null,4]
[null,null,5]
[null,null,6]
{"$rows_left_out":87}
{"sheet":"Complexities","index":3,"n_rows":56,"n_cols":10,"rows_kept":56,"cut":false,"hidden":false,"merged":[[50,7,50,8],[48,3,48,5],[3,7,3,9],[41,3,41,4],[54,7,54,8],[51,7,51,8],[52,7,52,8],[53,7,53,8],[41,6,44,9],[48,7,49,8],[1,1,1,10],[3,2,3,3],[4,2,4,3],[3,4,3,5],[4,4,4,5]]}
[]
[null,"EPR- Installations Charging Scheme Complexity - Application of Rules"]
[]
[null,null,"Company",null,{"$f":"Introduction!E8","v":"Horizon Nuclear Power Wylfa Ltd"}]
[null,null,"Permit",null,{"$f":"Introduction!I8","v":0}]
[]
[null,null,"Former Permit Ref     (if applicable)","Description / \nAggregation\nGroup","Schedule 1\nRef","Complexity","Rule 3\nCapping","Rule 5 not applied","Rule 6 not applied","Rule 7 Not Applied"]
[null,null,1,"4 x 25tph Boilers","1.1 Part A (1) a) (i)","C","","","",""]
[null,null,2,"2 x 3tph Boilers","1.1 Part A (1) a) (i)","C","","","",""]
[null,null,3,"ASGs x2 ","1.1 Part A (1) a) (i)","C","","","",""]
[null,null,4,"BBGs x4 (Units 1 & 2)","1.1 Part A (1) a) (i)","C","","","",""]
[null,null,5,"EDGs x3 (Unit 1)","1.1 Part A (1) a) (i)","C","","","",""]
[null,null,6,"EDGs x3 (Unit 2)","1.1 Part A (1) a) (i)","C","","","",""]
[null,null,7,"Firewater Pumps x2","1.1 Part A (1) a) (i)","C","","","",""]
[null,null,8,null,null,null,"","","",""]
{"$rows_left_out":42}
{"sheet":"Air","index":4,"n_rows":130,"n_cols":8,"rows_kept":130,"cut":false,"hidden":false,"merged":[[131,2,131,7],[2,2,2,7],[4,7,5,7],[4,3,4,5],[5,3,5,5],[124,2,124,7]]}
[]
[]
[null,null,"Emissions Attribute - Releases to Air"]
[]
[null,null,"Organisation Name:",{"$f":"Introduction!E8","v":"Horizon Nuclear Power Wylfa Ltd"},null,null,null,"Please check that the data is entered in the correct units.\nThe Emission Index will only show if the data entered exceeds the threshold."]
[null,null,"Case Number:",{"$f":"Introduction!I8","v":0}]
[null,null,"Please tick box if this sheet is applicable"]
[null,null,"Substance","Units","Emission Threshold","Maximum Quantity","Emission Index","Notes"]
[null,null,"Oxides of Sulphur","Tonnes Year",10,null,{"$f":"IF(F9/E9<1,0,(F9/E9))","v":0}]
[null,null,"Oxides of Nitrogen","Tonnes Year",10,92.5,{"$f":"IF(F10/E10<1,0,(F10/E10))","v":9.25},"Estimated from average annual operting hours (Tables 5.9 (boilers) and 5.10 (generators) in the supporting document) and the g/s emission rates given in the Air dispersion modelling report (appendix A of Appendix A)"]
[null,null,"Carbon Monoxide","Tonnes Year",1000,null,0]
[]
[]
[null,null,"Beryllium","Kg year",1,null,0]
[null,null,"Cadmium","Kg year",1,null,0]
{"$rows_left_out":116}
{"sheet":"Water","index":5,"n_rows":91,"n_cols":8,"rows_kept":91,"cut":false,"hidden":false,"merged":[[85,2,85,7],[76,2,76,3],[2,2,2,7],[4,5,5,7],[4,3,4,4],[5,3,5,4]]}
[]
[]
[null,null,"Emissions Attribute - Releases to  Water"]
[]
[null,null,"Orgnisation Name:",{"$f":"Introduction!E8","v":"Horizon Nuclear Power Wylfa Ltd"},null,"Please check that the data is entered in the correct units.\nThe Emission Index will only show if the data entered exceeds the threshold."]
[null,null,"Case Number:",{"$f":"Introduction!I8","v":0}]
[null,null,"Please tick box if this sheet is applicable"]
[null,null,"Substance","Units","Emission Threshold","Maximum Quantity","Emission Index","Notes"]
[null,null,"Aldrin","Kg year",1E-3,null,{"$f":"IF(F9/E9<1,0,(F9/E9))","v":0}]
[null,null,"Azinphos-ethyl","Kg year",1E-3,null,{"$f":"IF(F10/E10<1,0,(F10/E10))","v":0}]
[null,null,"DDT all isomers","Kg year",1E-3,null,{"$f":"IF(F11/E11<1,0,(F11/E11))","v":0}]
[null,null,"Endosulfan","Kg year",1E-3,null,0]
[null,null,"Endrin","Kg year",1E-3,null,0]
[null,null,"Fenitrothion","Kg year",1E-3,null,0]
[null,null,"Fenthion","Kg year",1E-3,null,0]
{"$rows_left_out":77}
{"sheet":"Land","index":6,"n_rows":14,"n_cols":8,"rows_kept":14,"cut":false,"hidden":false,"merged":[[2,1,2,8],[4,5,5,7]]}
[]
[]
[null,"Emissions Attribute Releases to Land"]
[]
[null,null,"Organisation Name:",{"$f":"Introduction!E8","v":"Horizon Nuclear Power Wylfa Ltd"},null,"Please check that the data is entered in the correct units.\nThe Emission Index will only show if the data entered exceeds the threshold."]
[null,null,"Case Number:",{"$f":"Introduction!I8","v":0}]
[null,null,"Please tick box if this sheet is applicable"]
[null,null,"Substance/Landfill Type","Units","Emission Threshold","Maximum Quantity","Emission Index","Notes"]
[null,null,"Inert waste","Tonnes year",1000,null,{"$f":"IF(F9/E9<1,0,(F9/E9))","v":0}]
[null,null,"Non hazardous waste (non biodegradable)","Tonnes year",350,null,{"$f":"IF(F10/E10<1,0,(F10/E10))","v":0}]
[null,null,"Hazardous waste","Tonnes year",100,null,{"$f":"IF(F11/E11<1,0,(F11/E11))","v":0}]
[null,null,"Non hazardous waste (biodegradable)","Tonnes year",100,null,{"$f":"IF(F12/E12<1,0,(F12/E12))","v":0}]
[]
[null,null,null,null,null,"Total",{"$f":"SUM(G9:G12)","v":0}]

{"sheet":"Sewer","index":7,"n_rows":93,"n_cols":8,"rows_kept":93,"cut":false,"hidden":false,"merged":[[2,1,2,8],[90,4,90,5],[92,4,92,5],[4,5,5,7],[4,3,4,4],[5,3,5,4],[85,2,85,7],[76,2,76,5]]}
[]
[]
[null,"Emissions Attribute - Off-site Disposals to Sewer"]
[]
[null,null,"Orgasination Name:",{"$f":"Introduction!E8","v":"Horizon Nuclear Power Wylfa Ltd"},null,"Please check that the data is entered in the correct units.\nThe Emission Index will only show if the data entered exceeds the threshold."]
[null,null,"Case number:",{"$f":"Introduction!I8","v":0}]
[null,null,"Please tick box if this sheet is applicable"]
[null,null,"Substance","Units","Emission Threshold","Maximum \nQuantity","Emission Index","Notes"]
[null,null,"Aldrin","Kg year",1E-3,null,{"$f":"IF(F9/E9<1,0,(F9/E9))","v":0}]
[null,null,"Azinphos-ethyl","Kg year",1E-3,null,0]
[null,null,"DDT all isomers","Kg year",1E-3,null,0]
[null,null,"Endosulfan","Kg year",1E-3,null,0]
[null,null,"Endrin","Kg year",1E-3,null,0]
[null,null,"Fenitrothion","Kg year",1E-3,null,0]
[null,null,"Fenthion","Kg year",1E-3,null,0]
{"$rows_left_out":79}
{"sheet":"Waste","index":8,"n_rows":51,"n_cols":8,"rows_kept":51,"cut":false,"hidden":false,"merged":[[0,1,0,8],[37,1,37,8],[39,2,39,7],[41,5,42,7],[1,2,1,7],[20,2,20,7],[32,4,32,5],[3,5,4,7],[33,4,33,5],[11,4,11,5],[12,4,12,5],[13,4,13,5],[31,4,31,5],[22,5,23,7],[18,1,18,8]]}
[]
[null,null,"Emissions Attribute - Off-site Disposals of Waste"]
[]
[null,null,"Organisation Name:",{"$f":"'Emissions Summary'!D4","v":"Horizon Nuclear Power Wylfa Ltd"},null,"Please check that the data is entered in the correct units.\nThe Emission Index will only show if the data entered exceeds the threshold."]
[null,null,"Case Number:",{"$f":"'Emissions Summary'!D5","v":0}]
[]
[null,null,"Substance","Units","Emission Threshold","Maximum Quantity","Emission Index","Notes"]
[null,null,"Inert waste","Tonnes year",1000,null,{"$f":"IF(F8/E8<1,0,(F8/E8))","v":0}]
[null,null,"Non hazardous waste (non biodegradable)","Tonnes year",350,null,{"$f":"IF(F9/E9<1,0,(F9/E9))","v":0}]
[null,null,"Hazardous waste","Tonnes year",100,null,{"$f":"IF(F10/E10<1,0,(F10/E10))","v":0}]
[null,null,"Non hazardous waste (biodegradable)","Tonnes year",100,null,{"$f":"IF(F11/E11<1,0,(F11/E11))","v":0}]
[null,null,null,null,"Total",null,{"$f":"SUM(G8:G11)","v":0}]
[null,null,null,null,"Weighting Factor",null,0.33,"(Weighting factor =  0.33)"]
[null,null,null,null,"Weighted Total",null,{"$f":"G12*G13","v":0}]
[]
{"$rows_left_out":37}
{"sheet":"Emissions Summary","index":9,"n_rows":27,"n_cols":5,"rows_kept":27,"cut":false,"hidden":false,"merged":[[20,3,20,4],[1,1,1,12]]}
[]
[null,"Emissions Attribute Summary Sheet"]
[]
[null,null,"Organisation:",{"$f":"Introduction!E8","v":"Horizon Nuclear Power Wylfa Ltd"}]
[null,null,"Case Number:",{"$f":"Introduction!I8","v":0}]
[]
[null,null,"Pathway","Overall Emission Index"]
[null,null,"Air",{"$f":"ROUND(Air!G130,0)","v":45}]
[null,null,"Water",{"$f":"ROUND(Water!G91,0)","v":0}]
[null,null,"Land",{"$f":"ROUND(Land!G14,0)","v":0}]
[null,null,"Sewer",{"$f":"ROUND(Sewer!G93,0)","v":0}]
[null,null,"Waste Off Site",{"$f":"ROUND(Waste!G35,0)","v":0}]
[null,null,"Waste Input",{"$f":"ROUND(Waste!G51,0)","v":0}]
[]
[]
{"$rows_left_out":13}
{"sheet":"Location","index":10,"n_rows":55,"n_cols":6,"rows_kept":55,"cut":false,"hidden":false,"merged":[[41,3,41,4],[42,3,42,4],[41,2,42,2],[6,3,6,5],[28,2,29,2],[32,5,39,5],[4,1,4,6],[10,5,15,5],[16,5,19,5],[28,5,31,5],[20,5,22,5],[7,3,7,5],[24,5,27,5],[24,3,24,4]]}
[null,"Yes"]
[null,"No"]
[]
[]
[null,"Location Attribute"]
[]
[null,null,"Organisation Name:",{"$f":"Introduction!E8","v":"Horizon Nuclear Power Wylfa Ltd"}]
[null,null,"Case Number:",{"$f":"'Emissions Summary'!$D$5","v":0}]
[]
[null,null,"Parameter","Yes/No","Available","Score"]
[null,null,"Human Occupation/Presence:     ",null,null,{"$f":"IF(D12=\"Yes\",E12, IF(D14=\"Yes\",E14,IF(D16=\"Yes\",E16,0)))","v":1}]
[null,null,"a) if within 50m of the boundary",null,5]
[null,null," or:"]
[null,null,"b) if greater than 50m but less than 250m of boundary",null,3]
[null,null,"or:"]
{"$rows_left_out":41}
{"sheet":"Op Perf","index":11,"n_rows":999,"n_cols":19,"rows_kept":999,"cut":false,"hidden":false,"merged":[[223,11,229,11],[207,11,208,12],[207,34,207,40],[216,11,222,11],[207,20,207,26],[207,27,207,33],[207,13,207,19],[209,11,215,11],[37,7,37,8],[62,3,62,8],[66,7,66,8],[63,7,63,8],[64,7,64,8],[47,3,47,8],[48,3,48,8],[49,3,49,8],[61,3,61,8],[60,2,60,8],[57,7,57,8],[56,7,56,8],[50,7,50,8],[51,7,51,8],[52,7,52,8],[53,7,53,8],[46,3,46,8],[36,7,36,8],[41,2,41,8],[42,3,42,8],[44,3,44,8],[38,7,38,8],[39,7,39,8],[33,7,33,8],[45,3,45,8],[43,3,43,8],[80,7,80,8],[92,3,97,3],[92,4,97,4],[92,5,97,5],[86,4,91,4],[65,7,65,8],[67,3,67,9],[69,7,69,8],[70,7,70,8],[71,7,71,8],[68,3,68,9],[72,3,72,8],[86,3,91,3],[86,5,91,5],[84,2,84,4],[73,7,73,8],[74,7,74,8],[75,7,75,8],[76,7,76,8],[81,7,81,8],[92,2,97,2],[77,7,77,8],[78,7,78,8],[79,7,79,8],[110,2,115,2],[110,4,114,4],[110,5,115,5],[104,3,109,3],[104,2,109,2],[104,4,109,4],[104,5,109,5],[110,3,115,3],[98,2,103,2],[98,4,103,4],[98,5,103,5],[98,3,103,3],[25,9,26,9],[34,7,34,8],[35,7,35,8],[30,7,30,8],[31,7,31,8],[32,7,32,8],[25,7,26,8],[27,7,27,8],[28,7,28,8],[29,7,29,8],[54,7,54,8],[55,7,55,8],[3,2,3,8],[23,3,23,8],[24,3,24,8],[7,2,7,8],[8,3,8,8],[21,3,21,8],[22,3,22,8],[20,2,20,8],[9,7,9,8],[10,7,10,8],[11,7,11,8],[12,7,12,8],[13,7,13,8],[14,7,14,8],[18,7,18,8],[5,7,5,8],[25,4,26,4],[15,7,15,8],[16,7,16,8],[17,7,17,8],[25,5,26,5],[25,6,26,6],[119,8,120,9],[119,7,123,7],[189,4,189,9],[155,3,155,8],[162,3,162,7],[130,2,131,3],[151,3,152,3],[151,4,152,6],[151,7,152,7],[151,8,152,8],[149,3,149,6]]}
["Yes"]
["No"]
[]
[null,null,"Operator Performance"]
[]
[null,null,null,null,"Yes/No","Points available","Points scored","Post or group responsible for each requirement",null,"Document reference (*) or date by which systems will be in place (*see para 4.4.2)"]
[]
[null,null,"Operations and Maintenance section - 20% "]
[null,null,null,"Effective operational and prev maintenance systems shall be employed on all aspects of the process where any failure could impact on the environment.  "]
[null,null,1,"Are there documented operating procedures for operations that may have an adverse impact on the environment?","Yes",2,{"$f":"IF(E10=\"yes\",F10,0)","v":2},null,null,"Prior to 01/04/2025"]
[null,null,2,"Is there a defined procedure for identifying, reviewing and prioritising items of plant for which a preventative maintenance regime is appropriate?","Yes",2,2,null,null,"Prior to 01/04/2025"]
[null,null,3,"Are there documented procedures for monitoring emissions or impacts?","Yes",2,2,null,null,"Prior to 01/04/2025"]
[null,null,4,"Is there a preventative maintenance programme for those items of plant whose failure could lead to impact on the environment? ","Yes",1,1,null,null,"Prior to 01/04/2025"]
[null,null,5,"Does the preventative maintenance programme include regular checks and formal inspections of 'static'  items such as tanks, pipework, retaining walls, bunds and ducts?","Yes",1,1,null,null,"Prior to 01/04/2025"]
[null,null,6,"Do the operations and maintenance systems include auditing environmental performance?","Yes",2,2,null,null,"Prior to 01/04/2025"]
{"$rows_left_out":985}
{"sheet":"EP Summary","index":12,"n_rows":22,"n_cols":8,"rows_kept":22,"cut":false,"hidden":false,"merged":[[8,2,8,3],[21,2,21,4],[20,3,20,4],[13,2,13,3],[7,4,7,5],[11,2,11,3],[14,2,18,2],[14,4,18,4],[12,2,12,3],[9,2,9,3],[10,2,10,3],[2,2,2,5],[3,2,3,3],[4,3,4,4],[5,3,5,4],[7,6,7,7]]}
[]
[]
[null,null,"Opra Banded Profile"]
[]
[null,null,"Organisation Name:",{"$f":"Introduction!E8","v":"Horizon Nuclear Power Wylfa Ltd"}]
[null,null,"Case Number:",{"$f":"Introduction!I8","v":0}]
[]
[null,null,null,null,"Profile before any rules or capping applied",null,"Opra Banded Profile used for charging"]
[null,null,"Attribute",null,"Number","Band","Number","Band"]
[null,null,"Complexity",null,{"$f":"Complexities!H51","v":0},"A",{"$f":"Complexities!F51","v":0},"A"]
[null,null,null,null,{"$f":"Complexities!H52","v":0},"B",{"$f":"Complexities!F52","v":0},"B"]
[null,null,null,null,{"$f":"Complexities!H53","v":7},"C",{"$f":"Complexities!F53","v":0},"C"]
[null,null,null,null,{"$f":"Complexities!H54","v":0},"D",{"$f":"Complexities!F54","v":0},"D"]
[null,null,null,null,{"$f":"Complexities!H55","v":0},"E",{"$f":"Complexities!F55","v":0},"E"]
[null,null,"Emissions","Air",null,{"$f":"'Emissions Summary'!E22","v":"B"},null,{"$f":"'Emissions Summary'!E22","v":"B"}]
{"$rows_left_out":8}
{"sheet":"Calculation","index":13,"n_rows":42,"n_cols":15,"rows_kept":42,"cut":false,"hidden":false,"merged":[[2,3,2,4],[2,5,2,6],[2,7,2,8],[24,3,24,5],[39,5,39,7],[32,5,32,8],[33,5,33,7],[26,5,26,9],[27,5,30,9],[34,5,34,7],[35,5,35,7],[36,5,36,7],[38,5,38,7],[37,5,37,7]]}
[]
[]
[null,null,"Organisation Name:",{"$f":"Introduction!E8","v":"Horizon Nuclear Power Wylfa Ltd"},null,"Case Number:",null,{"$f":"Introduction!I8","v":0}]
[]
[null,null,"EPR Installations Application Charge Calculation"]
[null,null,"(excludes Compliance Rating)"]
[null,null,"Scoring Summary - Financial"]
[]
[null,null,"Attribute","Band",null,"Score","Total Score"]
[null,null,"Complexity","A",0,{"$f":"HLOOKUP(D10,Lookup!$C$5:$G$13,2,FALSE)","v":2},{"$f":"E10*F10","v":0}]
[null,null,null,"B",0,{"$f":"HLOOKUP(D11,Lookup!$C$5:$G$13,2,FALSE)","v":15},0]
[null,null,null,"C",3,{"$f":"HLOOKUP(D12,Lookup!$C$5:$G$13,2,FALSE)","v":45},135]
[null,null,null,"D",0,{"$f":"HLOOKUP(D13,Lookup!$C$5:$G$13,2,FALSE)","v":82},0]
[null,null,null,"E",0,{"$f":"HLOOKUP(D14,Lookup!$C$5:$G$13,2,FALSE)","v":110},0]
[null,null,null,null,3,{"$f":"HLOOKUP(D15,Lookup!$C$5:$G$13,2,FALSE)","v":{"$error":"#N/A"}},{"$error":"#N/A"}]
{"$rows_left_out":28}
{"sheet":"Compliance Rating","index":14,"n_rows":21,"n_cols":6,"rows_kept":21,"cut":false,"hidden":false,"merged":[]}
[]
[null,null,"Compliance Rating"]
[]
[null,null,"Breach Category*","Events","Score per event","Total"]
[null,null,1,0,60,{"$f":"IF(D5=\"\",\"-\",D5*E5)","v":0}]
[null,null,2,0,31,{"$f":"IF(D6=\"\",\"-\",D6*E6)","v":0}]
[null,null,3,0,4,{"$f":"IF(D7=\"\",\"-\",D7*E7)","v":0}]
[null,null,4,0,0.1,{"$f":"IF(D8=\"\",\"-\",D8*E8)","v":0}]
[]
[null,null,null,null,"Compliance Index",{"$f":"IF(F5&F6&F7&F8 = \"----\",\"-\",SUM(F5:F8))","v":0}]
[]
[null,null,null,"Compliance Rating Band",null,{"$f":"IF(F10=\"-\",\"No Data\",IF(F10>149,\"F\",IF(F10>60,\"E\",IF(F10>30,\"D\",IF(F10>10,\"C\",IF(F10>0,\"B\",\"A\"))))))","v":"A"}]
[]
[null,null,null,"Compliance Rating Multiplier",null,{"$f":"IF(F10=\"-\",1,HLOOKUP(F12,Lookup!$C$5:$H$14,10,FALSE))","v":0.95}]
[null,"* Under Compliance Classification Scheme (CCS)"]
{"$rows_left_out":7}
{"sheet":"XML Data","index":15,"n_rows":823,"n_cols":6,"rows_kept":823,"cut":false,"hidden":true,"merged":[]}
[null,null,null,null,null,"<?xml version=\"1.0\" encoding=\"utf-8\"?>"]
[null,null,null,null,null,"<?EP OPRA data instance developed by Sean Moore Piper Networking Ltd - This version for Consultation of Version 2 of the OPRA Methodology?>"]
[null,null,null,null,null,"<EPOPRA>"]
[null,null,null,null,null,"<section>"]
[null,"Spreadsheet Version","<spreadsheetVersion>",{"$f":"Introduction!D10","v":"NRW V1"},"</spreadsheetVersion>",{"$f":"CONCATENATE(C5,D5,E5)","v":"<spreadsheetVersion>NRW V1</spreadsheetVersion>"}]
[null,"Company Name","<organisationName>",{"$f":"Introduction!E8","v":"Horizon Nuclear Power Wylfa Ltd"},"</organisationName>",{"$f":"CONCATENATE(C6,D6,E6)","v":"<organisationName>Horizon Nuclear Power Wylfa Ltd</organisationName>"}]
[null,"Case Number","<caseNumber>",{"$f":"Introduction!I8","v":0},"</caseNumber>",{"$f":"CONCATENATE(C7,D7,E7)","v":"<caseNumber>0</caseNumber>"}]
[null,null,"<confidentiality>",{"$f":"IF(Introduction!J19=\"\",\"\",\"Commercial-in-Confidence\")","v":""},"</confidentiality>"]
[null,"Start of  Listed Activities","<activities>",null,null,{"$f":"C9","v":"<activities>"}]
[1,"1 - 25 are extracted from Listed Activities sheet","<caseActivity>",null,null,{"$f":"C10","v":"<caseActivity>"}]
[null,"Activity Description","<actDescript>",{"$f":"'Listed Activities'!D8","v":"4 x 25tph Boilers"},"</actDescript>","<actDescript>4 x 25tph Boilers</actDescript>"]
[null,"Schedule 1 reference","<actId>",{"$f":"'Listed Activities'!G8","v":232},"</actId>","<actId>232</actId>"]
[null,"Complexity Band","<actComplexity>",{"$f":"UPPER('Listed Activities'!F8)","v":"C"},"</actComplexity>","<actComplexity>C</actComplexity>"]
[null,null,"</caseActivity>",null,null,{"$f":"C14","v":"</caseActivity>"}]
[2,null,"<caseActivity>",null,null,{"$f":"C15","v":"<caseActivity>"}]
{"$rows_left_out":809}
{"sheet":"Amendment record","index":16,"n_rows":37,"n_cols":3,"rows_kept":37,"cut":false,"hidden":true,"merged":[[35,0,35,2],[24,0,24,1],[18,0,18,1],[16,0,16,1],[0,0,0,2],[1,0,1,1],[8,0,8,1],[14,0,14,1],[32,0,32,2]]}
["ep_opra_ppc_m2"]
["version 2.01"]
[1,"12th Mar 2004","Spurious column heading in Op Perf sheet removed"]
[2,"15th Mar 2004","In Air sheet Hydrogen Sulphide to air  - units of measure entered"]
[3,"15th Mar 2004","Missing ASR identified and updated - those with no enumeration index have been given #147 (other activities)"]
[4,"14th Mar 2004","Fix to total of Complexities"]
[5,"15th Mar 2004","National Security removed from Air, Water and Sewer sheets"]
[6,"15th Mar 2004","Input form for Com in Conf amended to make all inputs obligatory if any one is present"]
["version 2.02"]
[7,"24th Mar 2004","The version number is now stored in a single cell, formula still to be added to xml sheet to split into major and minor issue numbers (required for application form)."]
[8,"27th Mar 2004","All combo boxes have 'input match' set to True - to stop people inputting there own (invalid) data"]
[9,"27th Mar 2004","Enumerated list indexes corrected"]
[10,"27th Mar 2004","ASRs (Activities) checked and new added to match regulation, see final spreadsheet from Ian Haskell"]
[11,"29th Mar 2004","Sign off of ASRs (Tel call Ian Haskell)"]
["version 2.03"]
{"$rows_left_out":23}
{"sheet":"Lookup","index":17,"n_rows":30,"n_cols":8,"rows_kept":30,"cut":false,"hidden":true,"merged":[[3,2,3,6]]}
[]
[null,"Part A(1) Band Score Lookup Table",null,null,null,"(Source:  PPC Charging Consultation Oct 2005)"]
[]
[null,null,"Band Score"]
[null,"Attribute","A","B","C","D","E","F"]
[null,"Complexity",2,15,45,82,110]
[null,"Emissions to Air",3,10,20,35,50]
[null,"Emissions to Water",3,10,20,35,50]
[null,"Emissions to Land",3,10,20,35,50]
[null,"Location",3,10,20,40,60]
[null,"Operator Management",10,25,40,60,75]
[null,"Third party Water",1,2,3,5,10]
[null,"Third party Land",1,2,3,5,10]
[null,"Compliance Rating",0.95,1,1.1000000000000001,1.25,1.5,3]
[]
{"$rows_left_out":15}